{"text_format":"1","workbook":"xlsx","n_sheets":8,"sheets":["Cover","Evaluation","Rating Sheet","Comments","AnnualGoalsObj","AnnualActionPlan","6 month review Action Plan","Drop Down Menu"],"not_rendered":{"charts":0,"images":0,"macros":1,"external_links":0,"defined_names":42,"comments":0,"pivot_tables":0},"unopened":[],"bounds":{"document_bytes":16777216,"sheet_cells":100000,"rows_first":2000,"rows_last":500,"rows_between":2000,"halvings":0,"cell_chars":16384,"cell_head_chars":4096},"cells_cut":0,"cells_raw":0,"read":"whole","date_system":"1900"}

{"sheet":"Cover","index":0,"n_rows":30,"n_cols":8,"rows_kept":30,"cut":false,"hidden":false,"merged":[[0,0,0,8],[1,0,1,8],[5,7,5,8],[10,2,10,4],[2,0,2,8],[5,1,5,2],[7,1,7,2],[29,0,33,8],[25,0,25,8],[18,0,18,8],[23,0,23,6],[12,0,15,8]]}
["East Lake Tarpon Special Fire Control District"]
[]
["PERFORMANCE APPRAISAL SYSTEM"]
[]
[]
["Employee:  ",null,null,"#: ",null,null,"Date:"]
[]
["Title:","Firefighter ",null,null,"Appraisal Period",null,null," - "]
[]
[]
["Evaluation Prepared By:"]
[]
["Instructions:  Using the accompanying rating scales and evaluator guidelines, each employee will be given a numerically-based evaluation to describe their level of performance during the current appraisal period on all applicable items.  Supervisors should use supporting data and be fair, reasonable, and as objective as possible."]
[]
[]
[]
[]
[]
["Level of Performance - Numerical Ratings Are As Follows:"]
[]
[]
["Rating 3 - EXCEEDS PERFORMANCE STANDARDS"]
[]
["Rating 2 - MEETS PERFORMANCE STANDARDS"]
[]
["Rating 1 - MARGINAL PERFORMANCE/IMPROVEMENT EXPECTED"]
[]
[]
[]
["NOTE:  A section is provided for adding supporting comments for ratings on the evaluation sheet.  Supervisors should be prepared to provide supporting comments.  The expectation is that each employee must maintain an overall rating of at least \"meets performance standards\".  Further, employees are advised that even where such overall rating is maintained, continued deficiencies in a single performance dimension may ultimately result in separation."]

{"sheet":"Evaluation","index":1,"n_rows":423,"n_cols":3,"rows_kept":423,"cut":false,"hidden":false,"merged":[[0,0,0,1],[1,0,1,1],[325,0,325,1],[327,0,327,1],[278,0,278,1],[48,0,48,1]]}
["SECTION I"]
["A.  Communications"]
[null,null,"RATING"]
[1,"Interpersonal Skills"]
[null,"Developing and maintaining effective working relationships with coworkers (supervisors and peers); Displaying respect and courtesy to others; Backing up and supporting coworkers as appropriate; Encouraging cooperation between coworkers."]
[]
[null,"RATING 3 - EXCEEDS PERFORMANCE STANDARDS "]
[null,"Exceptionally courteous and respectful with all employees; Consistently seeks to develop and maintain positive working relationships; Handles difficult interpersonal situations extremely effectively; Actively promotes harmony among coworkers."]
[]
[null,"RATING 2 - MEETS PERFORMANCE STANDARDS"]
[null,"Consistently makes an effort to be courteous and respectful; Consistently maintains positive working relationships; Usually handles difficult personal relationships in a positive manner."]
[]
[null,"RATING 1 - MARGINAL PERFORMANCE/IMPROVEMENT EXPECTED"]
[null,"Has difficulty in establishing and maintaining effective working relationships; Does not promote or maintain harmony among peers, subordinates, or supervisors; Often reacts defensively when given feedback."]
[]
[null,"If rating is a 1 or 3, please provide comments below "]
[]
[null,null,"RATING"]
[2,"Oral Communications"]
[null,"Communicating effectively, accurately, and appropriately; Passing along information clearly and in an organized manner; Keeping coworkers informed when appropriate."]
[]
[null,"RATING 3 - EXCEEDS PERFORMANCE STANDARDS"]
[null,"Demonstrates exceptional organization and clarity when passing along information or expressing ideas orally; Demonstrates excellent presentation skills.  Oral communication is presented tactfully and diplomatically. "]
[]
[null,"RATING 2 - MEETS PERFORMANCE STANDARDS"]
[null,"Consistently displays effective oral communication skills by presenting information clearly and accurately."]
[]
[null,"RATING 1 - MARGINAL PERFORMANCE/IMPROVEMENT EXPECTED"]
[null,"Orally communicates in an unorganized manner; Is vague and ambiguous when expressing ideas or communicating information."]
[]
[null,"If rating is a 1 or 3, please provide comments below "]
[]
[null,null,"RATING"]
[3,"Written Communications"]
[null,"Effectively communicating through writing; Writing  clearly and in an organized manner; Demonstrating appropriate use of reference and supporting materials when creating documents; Using proper punctuation, grammar, and spelling."]
[]
[null,"RATING 3 - EXCEEDS PERFORMANCE STANDARDS"]
[null,"Demonstrates exceptional clarity, organization, and quality in written communications.  Written communication is presented tactfully and diplomatically. "]
[]
[null,"RATING 2 - MEETS PERFORMANCE STANDARDS"]
[null,"Shows consistent organization and quality in written communications."]
[]
[null,"RATING 1 - MARGINAL PERFORMANCE/IMPROVEMENT EXPECTED"]
[null,"Written material usually requires additional explanation for clarity; Employee tends to avoid written communications whenever possible."]
[]
[null,"If rating is a 1 or 3, please provide comments below "]
[]
[]
["B.  Policies & Procedures"]
[null,null,"RATING"]
[1,"Rules and Regulations"]
[null,"Working effectively within the framework of District SOP rules and regulations; Demonstrating a knowledge and understanding of Department/Division rules and regulations; Supporting compliance to rules and regulations for self as well as coworkers; Carrying out  work activities to meet standards as specified in Department/Division rules and regulations."]
[]
[null,"RATING 3 - EXCEEDS PERFORMANCE STANDARDS"]
[null,"Does not violate District SOP rules and regulations; Strongly influences coworkers to also comply with rules and regulations; Demonstrates an excellent working knowledge of rules and regulations; Consults rules and regulations to ensure compliance."]
[]
[null,"RATING 2 - MEETS PERFORMANCE STANDARDS"]
[null,"Consistently does not violate District SOP rules and regulations; Generally supports Department/Division rules and regulations among coworkers; Reviews rules and regulations when appropriate."]
[]
[null,"RATING 1 - MARGINAL PERFORMANCE/IMPROVEMENT EXPECTED"]
[null,"Demonstrates a lack of knowledge concerning District SOP rules and regulations; Must be informed of relevant rules and regulations; Has been disciplined for failure to comply with rules and regulations since last evaluation."]
[]
[null,"If rating is a 1 or 3, please provide comments below "]
[]
[null,null,"RATING"]
[2,"Collective Bargaining Agreement"]
[null,"Demonstrating a working knowledge of the Collective Bargaining Agreement; Supporting compliance to the Collective Bargaining Agreement for self as well as coworkers; Carrying out work activities in accordance with the Collective Bargaining Agreement."]
[]
[null,"RATING 3 - EXCEEDS PERFORMANCE STANDARDS"]
[null,"Demonstrates an excellent working knowledge of the Collective Bargaining Agreement; Consults Collective Bargaining Agreement to ensure compliance."]
[]
[null,"RATING 2 - MEETS PERFORMANCE STANDARDS"]
[null,"Demonstrates an average working knowledge of the Collective Bargaining Agreement; Consults Collective Bargaining Agreement to ensure compliance."]
[]
[null,"RATING 1 - MARGINAL PERFORMANCE/IMPROVEMENT EXPECTED"]
[null,"Demonstrates a lack of knowledge of the Collective Bargaining Agreement and fails to review it; Must be informed of particular details of the Collective Bargaining Agreement that are pertinent to him/her; Often misinterprets sections of the Collective Bargaining Agreement."]
[]
[null,"If rating is a 1 or 3, please provide comments below "]
[]
[null,null,"RATING"]
{"$rows_left_out":344}
{"sheet":"Rating Sheet","index":2,"n_rows":86,"n_cols":18,"rows_kept":86,"cut":false,"hidden":false,"merged":[[7,6,7,7],[7,0,7,1],[7,2,7,4],[73,3,73,7],[67,3,67,15],[61,3,61,15],[62,3,62,15],[63,3,63,15],[68,3,68,15],[69,3,69,15],[37,3,37,15],[38,3,39,15],[33,3,33,15],[34,3,34,15],[35,3,35,15],[36,3,36,15],[0,0,0,17],[1,0,1,17],[2,0,2,17],[56,3,56,7],[22,3,22,15],[23,3,23,15],[51,3,51,15],[52,3,52,15],[50,3,50,15],[40,3,41,15],[42,3,44,15],[7,14,7,15],[85,4,85,14],[77,5,77,7],[79,5,79,7],[81,5,81,7],[84,0,84,3],[84,5,84,14],[32,3,32,15],[29,3,29,15],[30,3,30,15],[13,3,13,15],[14,3,14,15],[15,3,15,15],[21,3,21,15],[31,3,31,15]]}
["East Lake Tarpon Special Fire Control District"]
[]
["PERFORMANCE APPRAISAL SYSTEM"]
[]
[]
[]
[]
["Employee:  ",null,{"$f":"Cover!B6","v":0},null,null,null,"#: ",null,{"$f":"Cover!E6","v":0},null,null,"Date:",null,null,{"$f":"Cover!H6","v":"00:00:00"}]
[]
[]
[]
["A.",null,"COMMUNICATIONS",null,null,null,null,null,null,null,null,null,null,null,null,null,null,"RATINGS"]
[]
[null,null,"1.","Interpersonal Skills",null,null,null,null,null,null,null,null,null,null,null,null,null,{"$f":"Evaluation!C4","v":0}]
[null,null,"2.","Oral Communications",null,null,null,null,null,null,null,null,null,null,null,null,null,{"$f":"Evaluation!C19","v":0}]
[null,null,"3.","Written Communication",null,null,null,null,null,null,null,null,null,null,null,null,null,{"$f":"Evaluation!C34","v":0}]
[]
[null,null,null,{"$f":"SUM(R14:R16)","v":0},"/",3,"=",null,{"$f":"SUM(D18/F18)","v":0},"x",0.15,"=",null,null,{"$f":"SUM(I18*K18)","v":0}]
[]
["B.",null,"POLICIES AND PROCEDURES"]
[]
[null,null,"1.","Rules and Regulations",null,null,null,null,null,null,null,null,null,null,null,null,null,{"$f":"Evaluation!C51","v":0}]
[null,null,"2.","Collective Bargaining Agreement",null,null,null,null,null,null,null,null,null,null,null,null,null,{"$f":"Evaluation!C66","v":0}]
[null,null,"3.","600 SOPs",null,null,null,null,null,null,null,null,null,null,null,null,null,{"$f":"Evaluation!C81","v":0}]
[]
[null,null,null,{"$f":"SUM(R22:R24)","v":0},"/",3,"=",null,{"$f":"SUM(D26/F26)","v":0},"x",0.15,"=",null,null,{"$f":"SUM(I26*K26)","v":0}]
[]
["C.",null,"JOB SPECIFIC PERFORMANCE"]
[]
[null,null,1,"Locating  Tactical Firefighting Equipment",null,null,null,null,null,null,null,null,null,null,null,null,null,{"$f":"Evaluation!C99","v":0}]
[null,null,2,"Use of Tactical Firefighting Equipment",null,null,null,null,null,null,null,null,null,null,null,null,null,{"$f":"Evaluation!C114","v":0}]
[null,null,3,"Maintenance of Apparatus",null,null,null,null,null,null,null,null,null,null,null,null,null,{"$f":"Evaluation!C129","v":0}]
[null,null,4,"Knowledge of the East Lake Fire District",null,null,null,null,null,null,null,null,null,null,null,null,null,{"$f":"Evaluation!C144","v":0}]
[null,null,5,"Performance of Station Duties",null,null,null,null,null,null,null,null,null,null,null,null,null,{"$f":"Evaluation!C160","v":0}]
[null,null,6,"Performance of Special Assignments",null,null,null,null,null,null,null,null,null,null,null,null,null,{"$f":"Evaluation!C175","v":0}]
[null,null,7,"Performance of Assigned Training",null,null,null,null,null,null,null,null,null,null,null,null,null,{"$f":"Evaluation!C190","v":0}]
[null,null,8,"Performance of Public Education Duties",null,null,null,null,null,null,null,null,null,null,null,null,null,{"$f":"Evaluation!C205","v":0}]
[null,null,9,"Operations of Life Support Equipment",null,null,null,null,null,null,null,null,null,null,null,null,null,{"$f":"Evaluation!C220","v":0}]
[null,null,10,"Knowledge of the Pinellas County Medical Operations Manual and Rules and Regulations"]
[null,null,null,null,null,null,null,null,null,null,null,null,null,null,null,null,null,{"$f":"Evaluation!C235","v":0}]
[null,null,11,"Infection Control Procedures and use of Personal Protective Equipment"]
[null,null,null,null,null,null,null,null,null,null,null,null,null,null,null,null,null,{"$f":"Evaluation!C250","v":0}]
[null,null,12,"Completion of Required Pinellas County Medical Training (CME), Current Certification of Pinellas County EMS, and State of Florida HRS"]
[]
[null,null,null,null,null,null,null,null,null,null,null,null,null,null,null,null,null,{"$f":"Evaluation!C250","v":0}]
[]
[null,null,null,{"$f":"SUM(R30:R45)","v":0},"/",12,"=",null,{"$f":"SUM(D47/F47)","v":0},"x",0.6,"=",null,null,{"$f":"SUM(I47*K47)","v":0}]
[]
["D.",null,"SPECIALTY REQUIREMENTS"]
[]
[null,null,"1.","Professional Development",null,null,null,null,null,null,null,null,null,null,null,null,null,{"$f":"Evaluation!C281","v":0}]
[null,null,"2.","Safety Awareness",null,null,null,null,null,null,null,null,null,null,null,null,null,{"$f":"Evaluation!C296","v":0}]
[null,null,3,"Physical Fitness",null,null,null,null,null,null,null,null,null,null,null,null,null,{"$f":"Evaluation!C311","v":0}]
[]
[null,null,null,{"$f":"SUM(R51:R53)","v":0},"/",3,"=",null,{"$f":"SUM(D55/F55)","v":0},"x",0.1,"=",null,null,{"$f":"SUM(I55*K55)","v":0}]
[]
[null,null,null,"SECTION I TOTAL",null,null,null,null,{"$f":"SUM(O18+O26+O47+O55)","v":0},"x",0.7,"=",null,null,{"$f":"SUM(I57*K57)","v":0}]
["SECTION II"]
[]
["E.",null,"ADDITIONAL PERFORMANCE DIMENSIONS"]
[]
[null,null,"1.","Dealing with the General Public",null,null,null,null,null,null,null,null,null,null,null,null,null,{"$f":"Evaluation!C331","v":0}]
[null,null,"2.","Attention to Detail",null,null,null,null,null,null,null,null,null,null,null,null,null,{"$f":"Evaluation!C346","v":0}]
[null,null,"3.","Maintaining Confidentiality",null,null,null,null,null,null,null,null,null,null,null,null,null,{"$f":"Evaluation!C361","v":0}]
[]
[null,null,null,{"$f":"SUM(R62:R64)","v":0},"/",3,"=",null,{"$f":"SUM(D66/F66)","v":0},"x",0.8,"=",null,null,{"$f":"SUM(I66*K66)","v":0}]
[]
[null,null,"4.","Personal Appearance",null,null,null,null,null,null,null,null,null,null,null,null,null,{"$f":"Evaluation!C377","v":0}]
[null,null,"5.","Punctuality",null,null,null,null,null,null,null,null,null,null,null,null,null,{"$f":"Evaluation!C392","v":0}]
[null,null,"6.","Attendance ",null,null,null,null,null,null,null,null,null,null,null,null,null,{"$f":"Evaluation!C407","v":0}]
[]
[null,null,null,{"$f":"SUM(R68:R70)","v":0},"/",3,"=",null,{"$f":"SUM(D72/F72)","v":0},"x",0.2,"=",null,null,{"$f":"SUM(I72*K72)","v":0}]
[]
[null,null,null,"SECTION II TOTAL",null,null,null,null,{"$f":"SUM(O66+O72)","v":0},"x",0.3,"=",null,null,{"$f":"SUM(I74*K74)","v":0}]
[]
[]
[]
["TOTAL SECTION I",null,null,null,null,{"$f":"O57","v":0}]
[]
["TOTAL SECTION II",null,null,null,null,{"$f":"O74","v":0}]
{"$rows_left_out":7}
{"sheet":"Comments","index":3,"n_rows":107,"n_cols":3,"rows_kept":107,"cut":false,"hidden":false,"merged":[[70,0,70,2],[89,0,89,2],[90,0,92,1],[94,0,94,1],[103,0,103,1],[96,0,96,1],[97,0,97,1],[98,0,98,1],[99,0,99,1],[100,0,100,1],[101,0,101,1],[102,0,102,1]]}
["Employee:  ",{"$f":"Cover!B6","v":0}]
["Emp #:",{"$f":"Cover!E6","v":0}]
["Date:",{"$f":"Cover!H6","v":"00:00:00"}]
[]
[null,{"$f":"Evaluation!A2","v":"A.  Communications"}]
[1,{"$f":"Evaluation!B4","v":"Interpersonal Skills"},{"$f":"Evaluation!C4","v":0}]
[null,{"$f":"IF(OR(Evaluation!C4<>2),Evaluation!B17,\"Meets Performance Standards\")","v":0}]
[2,{"$f":"Evaluation!B19","v":"Oral Communications"},{"$f":"Evaluation!C19","v":0}]
[null,{"$f":"IF(OR(Evaluation!C19<>2),Evaluation!B32,\"Meets Performance Standards\")","v":0}]
[3,{"$f":"Evaluation!B34","v":"Written Communications"},{"$f":"Evaluation!C34","v":0}]
[null,{"$f":"IF(OR(Evaluation!C34<>2),Evaluation!B47,\"Meets Performance Standards\")","v":0}]
[]
[null,{"$f":"Evaluation!A49","v":"B.  Policies & Procedures"}]
[1,{"$f":"Evaluation!B51","v":"Rules and Regulations"},{"$f":"Evaluation!C51","v":0}]
[null,{"$f":"IF(OR(Evaluation!C51<>2),Evaluation!B64,\"Meets Performance Standards\")","v":0}]
[2,{"$f":"Evaluation!B66","v":"Collective Bargaining Agreement"},{"$f":"Evaluation!C66","v":0}]
[null,{"$f":"IF(OR(Evaluation!C66<>2),Evaluation!B79,\"Meets Performance Standards\")","v":0}]
[3,{"$f":"Evaluation!B81","v":"600 SOPs"},{"$f":"Evaluation!C81","v":0}]
[null,{"$f":"IF(OR(Evaluation!C81<>2),Evaluation!B95,\"Meets Performance Standards\")","v":0}]
[]
[null,{"$f":"Evaluation!A97","v":"C.  Job Specific Performance"}]
[1,{"$f":"Evaluation!B99","v":"Locating Tactical Firefighting Equipment "},{"$f":"Evaluation!C99","v":0}]
[null,{"$f":"IF(OR(Evaluation!C99<>2),Evaluation!B112,\"Meets Performance Standards\")","v":0}]
[2,{"$f":"Evaluation!B114","v":"Use of Tactical Firefighting Equipment "},{"$f":"Evaluation!C114","v":0}]
[null,{"$f":"IF(OR(Evaluation!C114<>2),Evaluation!B127,\"Meets Performance Standards\")","v":0}]
[3,{"$f":"Evaluation!B129","v":"Maintenance of Apparatus"},{"$f":"Evaluation!C129","v":0}]
[null,{"$f":"IF(OR(Evaluation!C129<>2),Evaluation!B142,\"Meets Performance Standards\")","v":0}]
[4,{"$f":"Evaluation!B144","v":"Knowledge of East Lake Fire District"},{"$f":"Evaluation!C144","v":0}]
[null,{"$f":"IF(OR(Evaluation!C144<>2),Evaluation!B158,\"Meets Performance Standards\")","v":0}]
[5,{"$f":"Evaluation!B160","v":"Performance of Station Duties"},{"$f":"Evaluation!C160","v":0}]
[null,{"$f":"IF(OR(Evaluation!C160<>2),Evaluation!B173,\"Meets Performance Standards\")","v":0}]
[6,{"$f":"Evaluation!B175","v":"Performance of Special Assignments"},{"$f":"Evaluation!C175","v":0}]
[null,{"$f":"IF(OR(Evaluation!C175<>2),Evaluation!B188,\"Meets Performance Standards\")","v":0}]
[7,{"$f":"Evaluation!B190","v":"Performance of Assigned Training"},{"$f":"Evaluation!C190","v":0}]
[null,{"$f":"IF(OR(Evaluation!C190<>2),Evaluation!B203,\"Meets Performance Standards\")","v":0}]
[8,{"$f":"Evaluation!B205","v":"Performance of Public Education Duties"},{"$f":"Evaluation!C205","v":0}]
[null,{"$f":"IF(OR(Evaluation!C205<>2),Evaluation!B218,\"Meets Performance Standards\")","v":0}]
[9,{"$f":"Evaluation!B220","v":"Operation of Life Support Equipment "},{"$f":"Evaluation!C220","v":0}]
[null,{"$f":"IF(OR(Evaluation!C220<>2),Evaluation!B233,\"Meets Performance Standards\")","v":0}]
[10,{"$f":"Evaluation!B235","v":"Knowledge of the Pinellas County MOM & Rules and Regulations"},{"$f":"Evaluation!C235","v":0}]
[null,{"$f":"IF(OR(Evaluation!C235<>2),Evaluation!B248,\"Meets Performance Standards\")","v":0}]
[11,{"$f":"Evaluation!B250","v":"Infection Control Procedures and Use of Personal Protective Equipment"},{"$f":"Evaluation!C250","v":0}]
[null,{"$f":"IF(OR(Evaluation!C250<>2),Evaluation!B263,\"Meets Performance Standards\")","v":0}]
[12,{"$f":"Evaluation!B265","v":"Completion of Required Pinellas County Medical Training (CME), Current Certification by Pinellas County EMS, and State of Florida HRS"},{"$f":"Evaluation!C265","v":0}]
[null,{"$f":"IF(OR(Evaluation!C265<>2),Evaluation!B278,\"Meets Performance Standards\")","v":0}]
[]
[null,{"$f":"Evaluation!A279","v":"D.  Specialty Requirements"}]
[1,{"$f":"Evaluation!B281","v":"Professional Development"},{"$f":"Evaluation!C281","v":0}]
[null,{"$f":"IF(OR(Evaluation!C281<>2),Evaluation!B294,\"Meets Performance Standards\")","v":0}]
[2,{"$f":"Evaluation!B296","v":"Safety Awareness "},{"$f":"Evaluation!C296","v":0}]
[null,{"$f":"IF(OR(Evaluation!C296<>2),Evaluation!B309,\"Meets Performance Standards\")","v":0}]
[3,{"$f":"Evaluation!B311","v":"Physical Fitness"},{"$f":"Evaluation!C311","v":0}]
[null,{"$f":"IF(OR(Evaluation!C311<>2),Evaluation!B324,\"Meets Performance Standards\")","v":0}]
[]
[null,{"$f":"Evaluation!A328","v":"E.  Additional Performance Dimensions"}]
[1,{"$f":"Evaluation!B331","v":"Dealing with the General Public"},{"$f":"Evaluation!C331","v":0}]
[null,{"$f":"IF(OR(Evaluation!C331<>2),Evaluation!B344,\"Meets Performance Standards\")","v":0}]
[2,{"$f":"Evaluation!B346","v":"Attention to Detail"},{"$f":"Evaluation!C346","v":0}]
[null,{"$f":"IF(OR(Evaluation!C346<>2),Evaluation!B359,\"Meets Performance Standards\")","v":0}]
[3,{"$f":"Evaluation!B361","v":"Maintaining Confidentiality "},{"$f":"Evaluation!C361","v":0}]
[null,{"$f":"IF(OR(Evaluation!C361<>2),Evaluation!B374,\"Meets Performance Standards\")","v":0}]
[4,{"$f":"Evaluation!B377","v":"Personal Appearance"},{"$f":"Evaluation!C377","v":0}]
[null,{"$f":"IF(OR(Evaluation!C377<>2),Evaluation!B390,\"Meets Performance Standards\")","v":0}]
[5,{"$f":"Evaluation!B392","v":"Punctuality"},{"$f":"Evaluation!C392","v":0}]
[null,{"$f":"IF(OR(Evaluation!C392<>2),Evaluation!B405,\"Meets Performance Standards\")","v":0}]
[6,{"$f":"Evaluation!B407","v":"Attendance   "},{"$f":"Evaluation!C407","v":0}]
[null,{"$f":"IF(OR(Evaluation!C407<>2),Evaluation!B420,\"Meets Performance Standards\")","v":0}]
[]
[null,"Evaluator's Additional Comments (Required) "]
[null,{"$f":"Evaluation!B424","v":0}]
["SIGN OFF"]
[]
["Lieutenant"]
[]
[null,"                                              (Signature)                                                      (Date)"]
[]
["Division Chief"]
[]
[null,"                                              (Signature)                                                      (Date)"]
[]
{"$rows_left_out":28}
{"sheet":"AnnualGoalsObj","index":4,"n_rows":48,"n_cols":20,"rows_kept":48,"cut":false,"hidden":false,"merged":[[47,19,47,22],[46,6,46,16],[46,19,46,22],[47,6,47,16],[9,10,9,12],[9,18,9,20],[43,6,43,16],[9,8,9,9],[9,5,9,7],[11,3,11,7],[44,6,44,16],[43,19,43,22],[44,19,44,22],[43,0,43,5],[9,0,9,4],[13,3,16,23],[32,3,35,21],[37,3,40,21],[19,0,20,21],[22,3,25,21],[7,3,7,10],[7,17,7,25],[27,3,30,21],[0,0,0,26],[2,0,2,26],[3,0,3,26],[4,0,4,26],[7,14,7,16],[7,0,7,2]]}
["East Lake Tarpon Special Fire Control District"]
[]
["Performance Management System"]
["Objectives"]
["Performance Improvement Plan - To Be Reviewed in One Year"]
[]
[]
["Employee:",null,null,{"$f":"Cover!B6","v":0},null,null,null,null,null,null,null,null,null,null,"Position:    ",null,null,{"$f":"Cover!B8","v":"Firefighter "}]
[]
["Appraisal Period",null,null,null,null,{"$f":"Cover!G8","v":"00:00:00"},null,null,"-",null,{"$f":"Cover!I8","v":"00:00:00"},null,null,null,"Today's Date:",null,null,null,{"$f":"Cover!H6","v":"00:00:00"}]
[]
["Part I.",null,null,"OBJECTIVES"]
[]
[null,null,null,"Identify areas from the Annual Performance Appraisal that need to be improved and/or other specific achievements that will assist the employee with his/her job skills, requirements, and/or future progression.  Any ratings of marginal or unsatisfactory must be included.  (Use additional pages if required)."]
[]
[]
[]
[]
[]
["Prepare this section during annual performance appraisal"]
[]
[]
[]
[null,1]
[]
[]
[]
[]
[null,2]
[]
[]
[]
[]
[null,3]
[]
[]
[]
[]
[null,4]
[]
[]
[]
[]
["Evaluation Prepared By:",null,null,null,null,null,{"$f":"Cover!C11","v":0},null,null,null,null,null,null,null,null,null,null,null,null,{"$f":"Cover!H6","v":"00:00:00"}]
[null,null,null,null,null,null,"Name",null,null,null,null,null,null,null,null,null,null,null,null,"Date"]
[]
["Employee Signature: "]
[null,null,null,null,null,null,"Name",null,null,null,null,null,null,null,null,null,null,null,null,"Date"]

{"sheet":"AnnualActionPlan","index":5,"n_rows":39,"n_cols":20,"rows_kept":39,"cut":false,"hidden":false,"merged":[[7,3,8,21],[37,19,37,22],[38,6,38,16],[38,19,38,22],[33,19,33,22],[34,6,34,16],[34,19,34,22],[33,6,33,16],[37,6,37,16],[0,0,0,26],[1,0,1,26],[2,0,2,26],[5,14,5,16],[5,0,5,2],[5,3,5,10],[5,17,5,25],[10,0,11,21],[33,0,33,5],[13,3,16,21],[18,3,21,21],[23,3,26,21],[28,3,31,21]]}
["PART II."]
["ACTION PLAN"]
[]
[]
[]
["Employee:",null,null,{"$f":"Cover!B6","v":0},null,null,null,null,null,null,null,null,null,null,"Position:    ",null,null,{"$f":"Cover!B8","v":"Firefighter "}]
[]
[null,null,null,"The Action Plan identifies the specific way in which each Goal and Objectives will be accomplished."]
[]
[]
["Prepare this section during annual performance appraisal"]
[]
[]
[]
[null,1]
[]
[]
[]
[]
[null,2]
[]
[]
[]
[]
[null,3]
[]
[]
[]
[]
[null,4]
[]
[]
[]
["Evaluation Prepared By:",null,null,null,null,null,{"$f":"Cover!C11","v":0},null,null,null,null,null,null,null,null,null,null,null,null,{"$f":"Cover!H6","v":"00:00:00"}]
[null,null,null,null,null,null,"Name",null,null,null,null,null,null,null,null,null,null,null,null,"Date"]
[]
[]
["Employee Signature: "]
[null,null,null,null,null,null,"Name",null,null,null,null,null,null,null,null,null,null,null,null,"Date"]

{"sheet":"6 month review Action Plan","index":6,"n_rows":40,"n_cols":20,"rows_kept":40,"cut":false,"hidden":false,"merged":[[13,3,16,13],[13,17,16,24],[10,17,11,24],[10,0,11,7],[0,0,0,26],[1,0,1,26],[2,0,2,26],[5,14,5,16],[5,0,5,2],[5,3,5,10],[5,17,5,25],[39,6,39,16],[39,19,39,22],[18,17,21,24],[23,17,26,24],[34,6,34,16],[38,6,38,16],[18,3,21,13],[23,3,26,13],[28,3,31,13],[28,17,31,24],[34,0,34,5],[34,19,34,22],[35,6,35,16],[35,19,35,22],[38,19,38,22]]}
["PART II."]
["ACTION PLAN"]
[]
[]
[]
["Employee:",null,null,{"$f":"Cover!B6","v":0},null,null,null,null,null,null,null,null,null,null,"Position:    ",null,null,{"$f":"Cover!B8","v":"Firefighter "}]
[]
[]
[]
[]
["Prepare this section during annual performance appraisal",null,null,null,null,null,null,null,null,null,null,null,null,null,null,null,null,"6 Month Review - Comments"]
[]
[]
[null,null,null,{"$f":"AnnualActionPlan!D14","v":0}]
[null,1]
[]
[]
[]
[null,null,null,{"$f":"AnnualActionPlan!D19","v":0}]
[null,2]
[]
[]
[]
[null,null,null,{"$f":"AnnualActionPlan!D24","v":0}]
[null,3]
[]
[]
[]
[null,null,null,{"$f":"AnnualActionPlan!D29","v":0}]
[null,4]
[]
[]
[]
[]
["Evaluation Prepared By:"]
[null,null,null,null,null,null,"Name",null,null,null,null,null,null,null,null,null,null,null,null,"Date"]
[]
[]
["Employee Signature: "]
[null,null,null,null,null,null,"Name",null,null,null,null,null,null,null,null,null,null,null,null,"Date"]

{"sheet":"Drop Down Menu","index":7,"n_rows":3,"n_cols":1,"rows_kept":3,"cut":false,"hidden":true,"merged":[]}
[3]
[2]
[1]